Target
Abscisic acid receptor PYL1/Protein phosphatase 2C 16
Ligand
BDBM313186
Substrate
Meas. Tech.
PP2C Activity Assay
IC50
104±n/a nM
Citation
 Loiseleur, OWendeborn, SVCutler, SR 2-oxo-3,4-dihydroquinolin-6-yl sulphonamide CPDS and their use as plant growth regulators US Patent  US10167261 Publication Date 1/1/2019 
Target
Name:
Abscisic acid receptor PYL1/Protein phosphatase 2C 16
Synonyms:
PYR1-HAB1
Type:
Protein
Mol. Mass.:
Description:
Components:
This complex has 2 components.
Component 1
Name:
Protein phosphatase 2C 16
Synonyms:
AtP2C-HA HAB1 P2C16_ARATH Protein HYPERSENSITIVE TO ABA 1 | Protein phosphatase 2C HAB1
Type:
Enzyme Catalytic Domain
Mol. Mass.:
55716.72
Organism:
Arabidopsis thaliana (Mouse-ear cress)
Description:
Residue:
511
  
Component 2
Name:
Abscisic acid receptor PYL1
Synonyms:
ABI1-binding protein 6 PYL1_ARATH RCAR12 | Regulatory components of ABA receptor 9
Type:
Enzyme Catalytic Domain
Mol. Mass.:
25355.15
Organism:
Arabidopsis thaliana (Mouse-ear cress)
Description:
Residue:
221
  
Inhibitor
Name:
BDBM313186
Synonyms:
US10167261, Compound Quinabactin
Type:
Small organic molecule
Emp. Form.:
C20H24N2O3S
Mol. Mass.:
372.481
SMILES:
CCCN1C(=O)CCc2cc(NS(=O)(=O)Cc3ccc(C)cc3)ccc12
: