Target
Carboxylic ester hydrolase
Ligand
BDBM8961
Substrate
BDBM8978
Meas. Tech.
Enzyme Inhibition Assay
IC50
44±n/a nM
Citation
 Pang, YPQuiram, PJelacic, THong, FBrimijoin, S Highly potent, selective, and low cost bis-tetrahydroaminacrine inhibitors of acetylcholinesterase. Steps toward novel drugs for treating Alzheimer's disease. J Biol Chem 271:23646-9 (1996)  
Target
Name:
Carboxylic ester hydrolase
Synonyms:
Acetylcholinesterase and butyrylcholinesterase (AChE and BChE) Butyrylcholinesterase (BuChE) | butyrylcholinesterase precursor
Type:
Enzyme
Mol. Mass.:
67776.22
Organism:
Rattus norvegicus (rat)
Description:
Residue:
597
  
Inhibitor
Name:
BDBM8961
Synonyms:
1,2,3,4-tetrahydro-9-acridinamine 9-THA CHEMBL1337960 Cognex Tracine cid_1935 | tacrine.HCl
Type:
Small organic molecule
Emp. Form.:
C13H14N2
Mol. Mass.:
198.2637
SMILES:
Nc1c2CCCCc2nc2ccccc12
:
Substrate
Name:
BDBM8978
Synonyms:
(Propylcarbonylthioethyl)trimethylammonium iodide CHEMBL148530 butyrylthiocholine | butyrylthiocholine chloride
Type:
Small organic molecule
Emp. Form.:
C9H20NOS
Mol. Mass.:
190.326
SMILES:
CCCC(=O)SCC[N+](C)(C)C
: