Target
CARBONIC ANHYDRASE
Ligand
BDBM10884
Substrate
BDBM10856
Meas. Tech.
CA Inhibition Assay
Ki
4360±n/a nM
Citation
 Nishimori, IMinakuchi, TMorimoto, KSano, SOnishi, STakeuchi, HVullo, DScozzafava, ASupuran, CT Carbonic anhydrase inhibitors: DNA cloning and inhibition studies of the alpha-carbonic anhydrase from Helicobacter pylori, a new target for developing sulfonamide and sulfamate gastric drugs. J Med Chem 49:2117-26 (2006)  
Target
Name:
CARBONIC ANHYDRASE
Synonyms:
Carbonic Anhydrase (hpCA) | hpCA
Type:
Enzyme
Mol. Mass.:
28277.52
Organism:
Helicobacter pylori J99
Description:
Q9ZK30
Residue:
247
  
Inhibitor
Name:
BDBM10884
Synonyms:
(2S,4S)-4-(ethylamino)-2-methyl-1,1-dioxo-2H,3H,4H-1,7-thieno[2,3-b]thiopyran-6-sulfonamide Dorzolamide (DZA)
Type:
Small organic molecule
Emp. Form.:
C10H16N2O4S3
Mol. Mass.:
324.44
SMILES:
CCN[C@H]1C[C@H](C)S(=O)(=O)c2sc(cc12)S(N)(=O)=O
:
Substrate
Name:
BDBM10856
Synonyms:
Carbon Dioxide | methanedione
Type:
Small organic molecule
Emp. Form.:
CO2
Mol. Mass.:
44.0095
SMILES:
O=C=O
: