Target
Carbonic anhydrase 5B, mitochondrial
Ligand
BDBM10868
Substrate
BDBM10856
Meas. Tech.
CA Inhibition Assay
Ki
2150±n/a nM
Citation
 Nishimori, IVullo, DInnocenti, AScozzafava, AMastrolorenzo, ASupuran, CT Carbonic anhydrase inhibitors. The mitochondrial isozyme VB as a new target for sulfonamide and sulfamate inhibitors. J Med Chem 48:7860-6 (2005)  
Target
Name:
Carbonic anhydrase 5B, mitochondrial
Synonyms:
CA-VB CAH5B_HUMAN Carbonic Anhydrase VB Carbonic anhydrase 5B, mitochondrial Carbonic anhydrase V | Carbonic anhydrase VB (CA VB)
Type:
Enzyme
Mol. Mass.:
36440.83
Organism:
Homo sapiens (Human)
Description:
Human (cloned) isozyme
Residue:
317
  
Inhibitor
Name:
BDBM10868
Synonyms:
1,3,4-Thiadiazole-2-sulfonamide, 6 5-Amino-1,3,4-thiadiazole-2-sulphonamide (1) CHEMBL265674 | aromatic/heteroaromatic sulfonamide 13
Type:
Small organic molecule
Emp. Form.:
C2H4N4O2S2
Mol. Mass.:
180.209
SMILES:
Nc1nnc(s1)S(N)(=O)=O
:
Substrate
Name:
BDBM10856
Synonyms:
Carbon Dioxide | methanedione
Type:
Small organic molecule
Emp. Form.:
CO2
Mol. Mass.:
44.0095
SMILES:
O=C=O
: