Target
D(2) dopamine receptor
Ligand
BDBM319701
Substrate
Meas. Tech.
D2 Receptor Antagonism Activity Test
IC50
1.06±n/a nM
Citation
 Jiang, HWang, ZLi, JZhang, RHe, YLiu, YBi, MLiu, ZTian, GChen, WYang, FWu, CWang, YJiang, XYin, JWang, GShen, J Heterocyclic compounds, process for preparation of the same and use thereof US Patent  US10174011 Publication Date 1/8/2019 
Target
Name:
D(2) dopamine receptor
Synonyms:
D(2) dopamine receptor DOPAMINE D2 Long DRD2 Dopamine D2 receptor Dopamine D2 receptor (D2R) Dopamine2-like | d2
Type:
Cell-surface receptors
Mol. Mass.:
50647.10
Organism:
Homo sapiens (Human)
Description:
P14416
Residue:
443
  
Inhibitor
Name:
BDBM319701
Synonyms:
6-(4-(4-(2-fluorobenzo[b]thiophen-4-yl)piperazin-1-yl)butyl)-3,4-dihydroquinolin-2(1H)-one | US10174011, Example 74
Type:
Small organic molecule
Emp. Form.:
C25H28FN3OS
Mol. Mass.:
437.573
SMILES:
Fc1cc2c(cccc2s1)N1CCN(CCCCc2ccc3NC(=O)CCc3c2)CC1
: