Target
Replicase polyprotein 1ab
Ligand
BDBM11274
Substrate
fluorogenic substrate peptide
Meas. Tech.
SARS-CoV 3CL Protease Inhibition Assay
pH
7±n/a
Temperature
298.15±n/a K
IC50
40000±n/a nM
Citation
 Tsai, KCChen, SYLiang, PHLu, ILMahindroo, NHsieh, HPChao, YSLiu, LLiu, DLien, WLin, THWu, SY Discovery of a novel family of SARS-CoV protease inhibitors by virtual screening and 3D-QSAR studies. J Med Chem 49:3485-95 (2006)  
Target
Name:
Replicase polyprotein 1ab
Synonyms:
3C-like proteinase 3C-like proteinase (SARS-CoV 3Cpro) 3CLp GFL Guanine-N7 methyltransferase Helicase Leader protein Non-structural protein 10 Non-structural protein 3 Non-structural protein 6 Non-structural protein 8 ORF1ab polyprotein PL2-PRO Pol R1AB_SARS RdRp SARS coronavirus main proteinase nsp1 nsp12 nsp14 nsp16 nsp3 nsp5 nsp7 nsp9 pp1ab | rep
Type:
Protein
Mol. Mass.:
790250.81
Organism:
Human SARS coronavirus (SARS-CoV) (Severe acute respiratory syndrome coronavirus)
Description:
P0C6X7
Residue:
7073
  
Inhibitor
Name:
BDBM11274
Synonyms:
N-[4-(propan-2-yl)phenyl]-2-{[4-(thiophen-2-yl)pyrimidin-2-yl]sulfanyl}acetamide pyrimidine-containing compound 11
Type:
Small organic molecule
Emp. Form.:
C19H19N3OS2
Mol. Mass.:
369.504
SMILES:
CC(C)c1ccc(NC(=O)CSc2nccc(n2)-c2cccs2)cc1
:
Substrate
Name:
fluorogenic substrate peptide
Synonyms:
Type:
Peptide
Mol. Mass.:
2662.93
Organism:
Description:
Residue:
24