Target
Replicase polyprotein 1ab
Ligand
BDBM11311
Substrate
fluorogenic substrate peptide
Meas. Tech.
SARS-CoV 3CL Protease Inhibition Assay
IC50
20000±n/a nM
Citation
 Lu, ILMahindroo, NLiang, PHPeng, YHKuo, CJTsai, KCHsieh, HPChao, YSWu, SY Structure-based drug design and structural biology study of novel nonpeptide inhibitors of severe acute respiratory syndrome coronavirus main protease. J Med Chem 49:5154-61 (2006)  
Target
Name:
Replicase polyprotein 1ab
Synonyms:
3C-like proteinase 3C-like proteinase (SARS-CoV 3Cpro) 3CLp GFL Guanine-N7 methyltransferase Helicase Leader protein Non-structural protein 10 Non-structural protein 3 Non-structural protein 6 Non-structural protein 8 ORF1ab polyprotein PL2-PRO Pol R1AB_SARS RdRp SARS coronavirus main proteinase nsp1 nsp12 nsp14 nsp16 nsp3 nsp5 nsp7 nsp9 pp1ab | rep
Type:
Protein
Mol. Mass.:
790250.81
Organism:
Human SARS coronavirus (SARS-CoV) (Severe acute respiratory syndrome coronavirus)
Description:
P0C6X7
Residue:
7073
  
Inhibitor
Name:
BDBM11311
Synonyms:
1,3-dimethyl-4-nitro-N-{[5-(thiophen-2-yl)thiophen-2-yl]methyl}-1H-pyrazol-5-amine acs.jmedchem.1c00409_ST.601
Type:
Small organic molecule
Emp. Form.:
C14H14N4O2S2
Mol. Mass.:
334.417
SMILES:
Cc1nn(C)c(NCc2ccc(s2)-c2cccs2)c1[N+]([O-])=O
:
Substrate
Name:
fluorogenic substrate peptide
Synonyms:
Type:
Peptide
Mol. Mass.:
2662.93
Organism:
Description:
Residue:
24