Target
Retinoid isomerohydrolase
Ligand
BDBM323445
Substrate
Meas. Tech.
In Vitro Isomerase Inhibition Assay
IC50
55.0±n/a nM
Citation
 Scott, ILKuksa, VAOrme, MWLittle, Jr., TLGall, AHong, F Alkoxy compounds for disease treatment US Patent  US10188615 Publication Date 1/29/2019 
Target
Name:
Retinoid isomerohydrolase
Synonyms:
Lutein isomerase RPE65 Retinal pigment epithelium-specific 65 kDa protein | Retinoid isomerohydrolase
Type:
Enzyme Catalytic Domain
Mol. Mass.:
60946.29
Organism:
Homo sapiens (Human)
Description:
Q16518
Residue:
533
  
Inhibitor
Name:
BDBM323445
Synonyms:
1-((3-(3-Aminopropyl)Phenoxy)Methyl)Cyclohexanol US10639286, Example 10
Type:
Small organic molecule
Emp. Form.:
C16H25NO2
Mol. Mass.:
263.3752
SMILES:
NCCCc1cccc(OCC2(O)CCCCC2)c1
: