Target
Retinoid isomerohydrolase
Ligand
BDBM323458
Substrate
Meas. Tech.
In Vitro Isomerase Inhibition Assay
IC50
55.0±n/a nM
Citation
 Scott, ILKuksa, VAOrme, MWLittle, Jr., TLGall, AHong, F Alkoxy compounds for disease treatment US Patent  US10188615 Publication Date 1/29/2019 
Target
Name:
Retinoid isomerohydrolase
Synonyms:
Lutein isomerase RPE65 Retinal pigment epithelium-specific 65 kDa protein | Retinoid isomerohydrolase
Type:
Enzyme Catalytic Domain
Mol. Mass.:
60946.29
Organism:
Homo sapiens (Human)
Description:
Q16518
Residue:
533
  
Inhibitor
Name:
BDBM323458
Synonyms:
(S)-1-Amino-3-(3-(2-Ethylbutoxy)Phenyl)Propan-2-Ol US10639286, Example 66
Type:
Small organic molecule
Emp. Form.:
C15H25NO2
Mol. Mass.:
251.3645
SMILES:
CCC(CC)COc1cccc(C[C@H](O)CN)c1
: