Target
Beta-secretase 2
Ligand
BDBM335424
Substrate
Meas. Tech.
BACE-2 Assay
Ki
0.600±n/a nM
Citation
 Walsh, SPCumming, JNHe, STaoka, BMTruong, QTWu, W C2-carbocyclic iminothiazine dioxides as BACE inhibitors, compositions, and their use US Patent  US9732088 Publication Date 8/15/2017 
Target
Name:
Beta-secretase 2
Synonyms:
AEPLC ASP1 Asp 1 Aspartyl protease 1 BACE2_HUMAN Beta-secretase (BACE) Beta-secretase 2 (BACE-2) Beta-site APP-cleaving enzyme 2 Memapsin-1 beta-Secretase (BACE-2)
Type:
Protein
Mol. Mass.:
56171.20
Organism:
Homo sapiens (Human)
Description:
Q9Y5Z0
Residue:
518
  
Inhibitor
Name:
BDBM335424
Synonyms:
8-((3-((3R,6S)-5-amino-6- cyclopropyl-6-(fluoromethyl)- 3-methyl-1,1-dioxido-3,6- dihydro-2H-1,4-thiazin-3-yl)-4- fluorophenyl)amino)-1,7- naphthyridine-3-carbonitrile | US9732088, Example 1
Type:
Small organic molecule
Emp. Form.:
C24H22F2N6O2S
Mol. Mass.:
496.532
SMILES:
C[C@]1(CS(=O)(=O)[C@@](CF)(C2CC2)C(N)=N1)c1cc(Nc2nccc3cc(cnc23)C#N)ccc1F
: