Target
Cytochrome P450 11B2, mitochondrial
Ligand
BDBM336520
Substrate
Meas. Tech.
HTRF-Based Assay
IC50
0.200±n/a nM
Citation
 Ali, ALo, MMMetzger, EYin, LHartmann, RHu, QHeim, RZimmer, C Indoline compounds as aldosterone synthase inhibitors US Patent  US9745282 Publication Date 8/29/2017 
Target
Name:
Cytochrome P450 11B2, mitochondrial
Synonyms:
Aldosterone Synthase (CYP11B2) Aldosterone-synthesizing enzyme CYP11B2 Cytochrome P450 11B2 Cytochrome P450 11B2, mitochondrial P-450C18 | Steroid 18-hydroxylase
Type:
Protein
Mol. Mass.:
57582.15
Organism:
Homo sapiens (Human)
Description:
P19099
Residue:
503
  
Inhibitor
Name:
BDBM336520
Synonyms:
1-(7-fluoro-5-(4- methylpyridin-3- yl)indolin-1-yl) ethanone | US9745282, 15
Type:
Small organic molecule
Emp. Form.:
C16H15FN2O
Mol. Mass.:
270.3015
SMILES:
CC(=O)N1CCc2cc(cc(F)c12)-c1cnccc1C
: