Target
CREB-binding protein
Ligand
BDBM340726
Substrate
Meas. Tech.
TR-FRET Binding Assay
IC50
4.00±n/a nM
Citation
 Adler, MAlbrecht, BKBronner, SChen, KXCôté, ACrawford, TCyr, PEgen, JKauder, SLai, KWLiao, JMagnuson, SMurray, JPastor, RRomero, FATaylor, AMTsui, VHWang, FZhu, B Therapeutic compounds and uses thereof US Patent  US9763922 Publication Date 9/19/2017 
Target
Name:
CREB-binding protein
Synonyms:
CBP CREB-binding protein (CBP) CREBBP
Type:
Transcription Coactivator
Mol. Mass.:
265411.66
Organism:
Homo sapiens (Human)
Description:
Q92793
Residue:
2442
  
Inhibitor
Name:
BDBM340726
Synonyms:
1-[3-[5-(difluoromethyl)-2-fluoro-4-(1-methylpyrazol-4-yl)anilino]-1-tetrahydropyran-4-yl-6,7-dihydro-4H-pyrazolo[4,3-c]pyridin-5-yl]propan-1-one | US9763922, Example 252
Type:
Small organic molecule
Emp. Form.:
C25H29F3N6O2
Mol. Mass.:
502.532
SMILES:
CCC(=O)N1CCc2c(C1)c(Nc1cc(C(F)F)c(cc1F)-c1cnn(C)c1)nn2C1CCOCC1
: