Target
CREB-binding protein
Ligand
BDBM340746
Substrate
Meas. Tech.
TR-FRET Binding Assay
IC50
2.00±n/a nM
Citation
 Adler, MAlbrecht, BKBronner, SChen, KXCôté, ACrawford, TCyr, PEgen, JKauder, SLai, KWLiao, JMagnuson, SMurray, JPastor, RRomero, FATaylor, AMTsui, VHWang, FZhu, B Therapeutic compounds and uses thereof US Patent  US9763922 Publication Date 9/19/2017 
Target
Name:
CREB-binding protein
Synonyms:
CBP CREB-binding protein (CBP) CREBBP
Type:
Transcription Coactivator
Mol. Mass.:
265411.66
Organism:
Homo sapiens (Human)
Description:
Q92793
Residue:
2442
  
Inhibitor
Name:
BDBM340746
Synonyms:
US9763922, Example 272
Type:
Small organic molecule
Emp. Form.:
C27H30F3N7O3
Mol. Mass.:
557.5674
SMILES:
CNC(=O)N1CCc2c(C1)c(Nc1cc(C(F)F)c(cc1F)-c1ccc(nc1)C(=O)NC)nn2C1CCOCC1
: