Target
cAMP-specific 3',5'-cyclic phosphodiesterase 4D [372-376,381-715,S375G,I381V,S383G,G384S,V385H,K386M)
Ligand
BDBM14781
Substrate
BDBM10851
Meas. Tech.
Phosphodiesterase (PDE) Inhibition Assay
IC50
>200000±n/a nM
Citation
 Card, GLBlasdel, LEngland, BPZhang, CSuzuki, YGillette, SFong, DIbrahim, PNArtis, DRBollag, GMilburn, MVKim, SHSchlessinger, JZhang, KY A family of phosphodiesterase inhibitors discovered by cocrystallography and scaffold-based drug design. Nat Biotechnol 23:201-7 (2005)  
Target
Name:
cAMP-specific 3',5'-cyclic phosphodiesterase 4D [372-376,381-715,S375G,I381V,S383G,G384S,V385H,K386M)
Synonyms:
DPDE3 PDE4D Phosphodiesterase Type 4 (PDE4D) | cAMP-specific 3,5-cyclic phosphodiesterase 4D
Type:
Enzyme Catalytic Domain
Mol. Mass.:
40034.37
Organism:
Homo sapiens (Human)
Description:
RECOMBINANT CATALYTIC DOMAIN OF HUMAN PHOSPHODIESTERASE 4D.
Residue:
349
  
Inhibitor
Name:
BDBM14781
Synonyms:
Pyrazole carboxylic ester 4 | ethyl 3-amino-1H-pyrazole-4-carboxylate
Type:
Small organic molecule
Emp. Form.:
C6H9N3O2
Mol. Mass.:
155.1546
SMILES:
CCOC(=O)c1cn[nH]c1N
:
Substrate
Name:
BDBM10851
Synonyms:
(4aR,6R,7R,7aS)-6-(6-amino-9H-purin-9-yl)-2,7-dihydroxy-hexahydro-1,3,5,2-furo[3,2-d][1,3,2]dioxaphosphinin-2-one ADENOSINE-3 ,5 -CYCLIC-MONOPHOSPHATE cAMP | cid_23902375
Type:
Small organic molecule
Emp. Form.:
C10H12N5O6P
Mol. Mass.:
329.2059
SMILES:
Nc1ncnc2n(cnc12)[C@@H]1O[C@@H]2COP(O)(=O)O[C@H]2[C@H]1O
: