Target
15-hydroxyprostaglandin dehydrogenase [NAD(+)]
Ligand
BDBM347439
Substrate
Meas. Tech.
In Vitro Assay
IC50
2.50±n/a nM
Citation
 Markowitz, SWillson, JKPosner, BReady, JAntczak, MZhang, YDesai, AGerson, SGreenlee, W Compositions and methods of modulating short-chain dehydrogenase activity US Patent  US9789116 Publication Date 10/17/2017 
Target
Name:
15-hydroxyprostaglandin dehydrogenase [NAD(+)]
Synonyms:
15-PGDH HPGD PGDH_HUMAN SDR36C1
Type:
Enzyme
Mol. Mass.:
28974.46
Organism:
Homo sapiens (Human)
Description:
P15428
Residue:
266
  
Inhibitor
Name:
BDBM347439
Synonyms:
US10869871, ID # SW209510 US9789116, SW209510
Type:
Small organic molecule
Emp. Form.:
C21H21N3O2S3
Mol. Mass.:
443.605
SMILES:
CCCCS(=O)c1sc2nc(cc(-c3ccc(CO)cc3)c2c1N)-c1nccs1
: