Target
Acidic mammalian chitinase
Ligand
BDBM349916
Substrate
Meas. Tech.
Human AMCase Activity Assay
IC50
<100±n/a nM
Citation
 Mazur, MKoralewski, RBorek, BOlejniczak, SCzestkowski, WJPiotrowicz, MCOlczak, JPGolebiowski, AABartoszewicz, AMaziarz, EKowalski, M Substituted amino triazoles useful as human chitinase inhibitors US Patent  US10208020 Publication Date 2/19/2019 
Target
Name:
Acidic mammalian chitinase
Synonyms:
AMCase CHIA Lung-specific protein TSA1902
Type:
Protein
Mol. Mass.:
52266.66
Organism:
Homo sapiens (Human)
Description:
Q9BZP6
Residue:
476
  
Inhibitor
Name:
BDBM349916
Synonyms:
5-(4-((2S,5S)-5-(4-chlorobenzyl)-2-isopropylmorpholino)piperidin-1-yl)-4H-1,2,4-triazol-3-amine US10538508, Example 6 | US9944624, Ex. 6
Type:
Small organic molecule
Emp. Form.:
C21H31ClN6O
Mol. Mass.:
418.963
SMILES:
CC(C)[C@H]1CN(C(Cc2ccc(Cl)cc2)CO1)C1CCN(CC1)c1nnc(N)[nH]1
: