Target
Acidic mammalian chitinase
Ligand
BDBM349925
Substrate
Meas. Tech.
Human AMCase Activity Assay
IC50
<100±n/a nM
Citation
 Mazur, MKoralewski, RBorek, BOlejniczak, SCzestkowski, WJPiotrowicz, MCOlczak, JPGolebiowski, AABartoszewicz, AMaziarz, EKowalski, M Substituted amino triazoles useful as human chitinase inhibitors US Patent  US10208020 Publication Date 2/19/2019 
Target
Name:
Acidic mammalian chitinase
Synonyms:
AMCase CHIA Lung-specific protein TSA1902
Type:
Protein
Mol. Mass.:
52266.66
Organism:
Homo sapiens (Human)
Description:
Q9BZP6
Residue:
476
  
Inhibitor
Name:
BDBM349925
Synonyms:
(R)-5-(2-(4-chlorobenzyl)-[1,4′-bipiperidin]-1′-yl)-4H-1,2,4-triazol-3-amine US10538508, Example 15 | US9944624, Ex. 15
Type:
Small organic molecule
Emp. Form.:
C19H27ClN6
Mol. Mass.:
374.911
SMILES:
Nc1nnc([nH]1)N1CCC(CC1)N1CCCCC1Cc1ccc(Cl)cc1
: