Target
Fibroblast growth factor receptor 3
Ligand
BDBM350052
Substrate
Meas. Tech.
Enzyme Assay
IC50
1.000±n/a nM
Citation
 Andrews, SWBlake, JFCook, AGunawardana, IWHunt, KWMetcalf, ATMoreno, DRen, LTang, TP 2-aryl- and 2-heteroaryl-substituted 2-pyridazin-3(2H)-one compounds as inhibitors of FGFR tyrosine kinases US Patent  US10208024 Publication Date 2/19/2019 
Target
Name:
Fibroblast growth factor receptor 3
Synonyms:
CD_antigen: CD333 FGFR3 Fibroblast growth factor receptor JTK4
Type:
Protein
Mol. Mass.:
87699.57
Organism:
Homo sapiens (Human)
Description:
P22607
Residue:
806
  
Inhibitor
Name:
BDBM350052
Synonyms:
US10208024, Example 51 | US10766881, Example 51
Type:
Small organic molecule
Emp. Form.:
C28H34N8O4
Mol. Mass.:
546.6208
SMILES:
COCCN1CCC(CC1)n1cc(cn1)-c1cnc(N)c(n1)-c1cc(C)c(=O)n(n1)-c1cc(OC)cc(OC)c1
: