Target
Beta-secretase 2
Ligand
BDBM16258
Substrate
Fluorogenic Substrate
Meas. Tech.
Enzyme Inhibition Measurements
pH
4.5±n/a
Temperature
310.15±n/a K
Ki
523±302 nM
Citation
 Ghosh, AKKumaragurubaran, NHong, LKulkarni, SSXu, XChang, WWeerasena, VTurner, RKoelsch, GBilcer, GTang, J Design, synthesis, and X-ray structure of potent memapsin 2 (beta-secretase) inhibitors with isophthalamide derivatives as the P2-P3-ligands. J Med Chem 50:2399-407 (2007)  
Target
Name:
Beta-secretase 2
Synonyms:
AEPLC ASP1 Asp 1 Aspartyl protease 1 BACE2_HUMAN Beta-secretase (BACE) Beta-secretase 2 (BACE-2) Beta-site APP-cleaving enzyme 2 Memapsin-1 beta-Secretase (BACE-2)
Type:
Protein
Mol. Mass.:
56171.20
Organism:
Homo sapiens (Human)
Description:
Q9Y5Z0
Residue:
518
  
Inhibitor
Name:
BDBM16258
Synonyms:
1-N-benzyl-3-N-[(1R,3S,4S)-3-hydroxy-1,6-dimethyl-1-{[(1S)-2-methyl-1-(propan-2-ylcarbamoyl)propyl]carbamoyl}heptan-4-yl]-5-(N-methylmethanesulfonamido)benzene-1,3-dicarboxamide | Isophthalamide Derivative 5c
Type:
Small organic molecule
Emp. Form.:
C35H53N5O7S
Mol. Mass.:
687.89
SMILES:
CC(C)C[C@H](NC(=O)c1cc(cc(c1)C(=O)NCc1ccccc1)N(C)S(C)(=O)=O)[C@@H](O)C[C@@H](C)C(=O)N[C@@H](C(C)C)C(=O)NC(C)C
:
Substrate
Name:
Fluorogenic Substrate
Synonyms:
Type:
Peptide
Mol. Mass.:
4212.11
Organism:
Description:
Residue:
42