Target
Aldo-keto reductase family 1 member B1
Ligand
BDBM16422
Substrate
BDBM16418
Meas. Tech.
Enzyme Inhibition Assay
pH
7±n/a
Temperature
298.15±n/a K
Ki
13000±2000 nM
Citation
 Brownlee, JMCarlson, EMilne, ACPape, EHarrison, DH Structural and thermodynamic studies of simple aldose reductase-inhibitor complexes. Bioorg Chem 34:424-44 (2006)  
Target
Name:
Aldo-keto reductase family 1 member B1
Synonyms:
AKR1B1 ALDR_HUMAN AR Aldose Reductase (ALR2) Aldose reductase (AR)
Type:
Protein
Mol. Mass.:
35855.50
Organism:
Homo sapiens (Human)
Description:
P15121. 4LAU; 2IKI; 4LB4; 2FZD; 2FZ8; 1US0
Residue:
316
  
Inhibitor
Name:
BDBM16422
Synonyms:
2-(2-fluorophenyl)acetic acid o-Fluorophenylacetic acid
Type:
Small organic molecule
Emp. Form.:
C8H7FO2
Mol. Mass.:
154.1384
SMILES:
OC(=O)Cc1ccccc1F
:
Substrate
Name:
BDBM16418
Synonyms:
benzyl alcohol | phenylmethanol
Type:
Small organic molecule
Emp. Form.:
C7H8O
Mol. Mass.:
108.1378
SMILES:
OCc1ccccc1
: