Target
Dihydrofolate reductase
Ligand
BDBM18223
Substrate
BDBM18044
Meas. Tech.
Determination of IC50
pH
7.4±n/a
Temperature
310.15±n/a K
IC50
1.0±n/a nM
Citation
 Chan, DCFu, HForsch, RAQueener, SFRosowsky, A Design, synthesis, and antifolate activity of new analogues of piritrexim and other diaminopyrimidine dihydrofolate reductase inhibitors with omega-carboxyalkoxy or omega-carboxy-1-alkynyl substitution in the side chain. J Med Chem 48:4420-31 (2005)  
Target
Name:
Dihydrofolate reductase
Synonyms:
DYR_PNECA Dihydrofolate reductase Tetrahydrofolate dehydrogenase
Type:
Enzyme
Mol. Mass.:
23891.29
Organism:
Pneumocystis carinii
Description:
Residue:
206
  
Inhibitor
Name:
BDBM18223
Synonyms:
6-{3-[(2,4-diaminopyrimidin-5-yl)methyl]-4,5-dimethoxyphenyl}hex-5-ynoic acid | Diaminopyrimidine analogue, 3
Type:
Small organic molecule
Emp. Form.:
C19H22N4O4
Mol. Mass.:
370.4024
SMILES:
COc1cc(cc(Cc2cnc(N)nc2N)c1OC)C#CCCCC(O)=O
:
Substrate
Name:
BDBM18044
Synonyms:
(2S)-2-[(4-{[(2-amino-4-oxo-1,4,7,8-tetrahydropteridin-6-yl)methyl]amino}phenyl)formamido]pentanedioic acid dihydrofolic acid
Type:
Small organic molecule
Emp. Form.:
C19H21N7O6
Mol. Mass.:
443.4133
SMILES:
Nc1nc2NCC(CNc3ccc(cc3)C(=O)N[C@@H](CCC(O)=O)C(O)=O)=Nc2c(=O)[nH]1
: