Target
Dihydrofolate reductase
Ligand
BDBM18225
Substrate
BDBM18044
Meas. Tech.
Determination of IC50
IC50
0.26±n/a nM
Citation
 Chan, DCFu, HForsch, RAQueener, SFRosowsky, A Design, synthesis, and antifolate activity of new analogues of piritrexim and other diaminopyrimidine dihydrofolate reductase inhibitors with omega-carboxyalkoxy or omega-carboxy-1-alkynyl substitution in the side chain. J Med Chem 48:4420-31 (2005)  
Target
Name:
Dihydrofolate reductase
Synonyms:
Dihydrofolate reductase (DHFR) | Tetrahydrofolate dehydrogenase
Type:
Enzyme
Mol. Mass.:
19884.75
Organism:
Mycobacterium avium
Description:
Recombinant Mycobacterium avium DHFR expressed in E. coli.
Residue:
181
  
Inhibitor
Name:
BDBM18225
Synonyms:
2,4-diamino-5-deazapteridine, 4 Piritrexim analogue, 6 | pyrido[2,3-d]pyrimidine analogue
Type:
Small organic molecule
Emp. Form.:
C20H23N5O4
Mol. Mass.:
397.4277
SMILES:
COc1ccc(OCCCC(O)=O)cc1Cc1cnc2nc(N)nc(N)c2c1C
:
Substrate
Name:
BDBM18044
Synonyms:
(2S)-2-[(4-{[(2-amino-4-oxo-1,4,7,8-tetrahydropteridin-6-yl)methyl]amino}phenyl)formamido]pentanedioic acid dihydrofolic acid
Type:
Small organic molecule
Emp. Form.:
C19H21N7O6
Mol. Mass.:
443.4133
SMILES:
Nc1nc2NCC(CNc3ccc(cc3)C(=O)N[C@@H](CCC(O)=O)C(O)=O)=Nc2c(=O)[nH]1
: