Target
Glucocorticoid receptor
Ligand
BDBM19234
Substrate
BDBM18207
Meas. Tech.
Competitive Receptor Binding Assay
pH
8±n/a
Temperature
277.15±n/a K
IC50
1.0±n/a nM
Citation
 Link, JTSorensen, BPatel, JGrynfarb, MGoos-Nilsson, AWang, JFung, SWilcox, DZinker, BNguyen, PHickman, BSchmidt, JMSwanson, STian, ZReisch, TJRotert, GDu, JLane, Bvon Geldern, TWJacobson, PB Antidiabetic activity of passive nonsteroidal glucocorticoid receptor modulators. J Med Chem 48:5295-304 (2005)  
Target
Name:
Glucocorticoid receptor
Synonyms:
GCR_RAT Glucocorticoid Receptor (GR) Grl | Nr3c1
Type:
Enzyme Catalytic Domain
Mol. Mass.:
87556.83
Organism:
RAT
Description:
Glucocorticoid 0 RAT::P06536
Residue:
795
  
Inhibitor
Name:
BDBM19234
Synonyms:
4-{4-[3-(4-{[benzyl(3-methanesulfonamido-2-methylphenyl)amino]methyl}phenoxy)phenoxy]butanamido}butanoic acid CHEMBL185265 | GR sulfonamide modulator, 4
Type:
Small organic molecule
Emp. Form.:
C36H41N3O7S
Mol. Mass.:
659.792
SMILES:
Cc1c(NS(C)(=O)=O)cccc1N(Cc1ccccc1)Cc1ccc(Oc2cccc(OCCCC(=O)NCCCC(O)=O)c2)cc1
:
Substrate
Name:
BDBM18207
Synonyms:
(1R,2S,10S,11S,13R,14R,15S,17S)-1-fluoro-14,17-dihydroxy-14-(2-hydroxyacetyl)-2,13,15-trimethyltetracyclo[8.7.0.0^{2,7}.0^{11,15}]heptadeca-3,6-dien-5-one US11554172, Compound Dexamethasone dexamethasone (tetramethyl-rhodamine conjugated )
Type:
Steroid
Emp. Form.:
C22H29FO5
Mol. Mass.:
392.4611
SMILES:
[H][C@@]12C[C@@H](C)[C@](O)(C(=O)CO)[C@@]1(C)C[C@H](O)[C@@]1(F)[C@@]2([H])CCC2=CC(=O)C=C[C@]12C
: