Target
Procathepsin L
Ligand
BDBM19564
Substrate
BDBM19584
Meas. Tech.
Enzyme Inhibition Assay
Ki
1.1±n/a nM
Citation
 Liu, HTully, DCEpple, RBursulaya, BLi, JHarris, JLWilliams, JARusso, RTumanut, CRoberts, MJAlper, PBHe, YKaranewsky, DS Design and synthesis of arylaminoethyl amides as noncovalent inhibitors of cathepsin S. Part 1. Bioorg Med Chem Lett 15:4979-84 (2005)  
Target
Name:
Procathepsin L
Synonyms:
CATL1_HUMAN CTSL CTSL1 Cathepsin L Cathepsin L1 heavy chain MEP cathepsin L preproprotein
Type:
Enzyme
Mol. Mass.:
37557.19
Organism:
Homo sapiens (Human)
Description:
Purchased from Calbiochem (San Diego, CA).
Residue:
333
  
Inhibitor
Name:
BDBM19564
Synonyms:
(2S)-N-{2-[(4-methoxyphenyl)amino]ethyl}-2-[(3-methylphenyl)formamido]-3-(naphthalen-2-yl)propanamide | arylaminoethyl amide, 5r
Type:
Small organic molecule
Emp. Form.:
C30H31N3O3
Mol. Mass.:
481.5854
SMILES:
COc1ccc(NCCNC(=O)[C@H](Cc2ccc3ccccc3c2)NC(=O)c2cccc(C)c2)cc1
:
Substrate
Name:
BDBM19584
Synonyms:
7-amino-3-carbamoylmethyl-4-methyl coumarin labeled fluorescent peptide | Ac-His-Lys-Phe-Lys-ACMC
Type:
Emp. Form.:
Mol. Mass.:
SMILES:
: