Target
Caspase-3
Ligand
BDBM10348
Substrate
Caspase-7 Fluorometric Substrate Ac-Asp-Glu-Val-Asp-AFC
Ki
16.1±n/a nM
Citation
 Aulabaugh, AKapoor, BHuang, XDollings, PHum, WTBanker, AWood, AEllestad, G Biochemical and biophysical characterization of inhibitor binding to caspase-3 reveals induced asymmetry. Biochemistry 46:9462-71 (2007)  
Target
Name:
Caspase-3
Synonyms:
Apopain CASP3 CPP-32 Caspase 3 Caspase-3 subunit p17 SCA-1 Yama protein | caspase-3 preproprotein
Type:
Hydrolase; heterotetramer of two heterodimers
Mol. Mass.:
31607.55
Organism:
Homo sapiens (Human)
Description:
Residue:
277
  
Inhibitor
Name:
BDBM10348
Synonyms:
5-(2-(Pyridin-3-yl-oxymethyl)-pyrrolidine-1-sulfonyl)-1H-indole-2,3-dione IST-1 | Pyridine Analogue 20
Type:
Small organic molecule
Emp. Form.:
C18H17N3O5S
Mol. Mass.:
387.41
SMILES:
O=C1Nc2ccc(cc2C1=O)S(=O)(=O)N1CCC[C@H]1COc1cccnc1
:
Substrate
Name:
Caspase-7 Fluorometric Substrate Ac-Asp-Glu-Val-Asp-AFC
Synonyms:
Ac-DEVD-AFC Fluorometric Tetrapeptide Ac-DEVD-AMC
Type:
Peptide
Mol. Mass.:
473.41
Organism:
Description:
Molecular Mass of DEVD
Residue:
4
DEVD