Target
Estrogen receptor
Ligand
BDBM19441
Substrate
17beta-estradiol (E2)
Meas. Tech.
ER-alpha Radioligand Binding Assay and ERE-Luciferase Reporter Assay.
pH
7.4±n/a
Temperature
295.15±n/a K
IC50
22±6 nM
EC50
2.4±0.7 nM
Comments
Antagonist activity in MCF-7 assay, IC50 = 1.4 +/- 1.0 nM; in the absence of 17beta-estradiol in the MCF-7 proliferation assay, compound displayed 22 +/- 9 % agonistic effect.
Citation
 Renaud, JBischoff, SFBuhl, TFloersheim, PFournier, BGeiser, MHalleux, CKallen, JKeller, HRamage, P Selective estrogen receptor modulators with conformationally restricted side chains. Synthesis and structure-activity relationship of ERalpha-selective tetrahydroisoquinoline ligands. J Med Chem 48:364-79 (2005)  
Target
Name:
Estrogen receptor
Synonyms:
ER ESR ESR1_HUMAN Estrogen receptor Estrogen receptor (ER-alpha) Estrogen receptor alpha (ER) Nuclear receptor subfamily 3 group A member 1
Type:
Protein
Mol. Mass.:
66230.44
Organism:
Homo sapiens (Human)
Description:
P03372
Residue:
595
  
Inhibitor
Name:
BDBM19441
Synonyms:
2-(4-hydroxyphenyl)-3-({4-[2-(piperidin-1-yl)ethoxy]phenyl}carbonyl)-1-benzothiophen-6-ol Evista RALOXIFENE HYDROCHLORIDE Raloxifene (7) [6-hydroxy-2-(4-hydroxyphenyl)-1-benzothiophen-3-yl]-[4-(2-piperidin-1-ylethoxy)phenyl]methanone | cid_11071264
Type:
Small organic molecule
Emp. Form.:
C28H27NO4S
Mol. Mass.:
473.583
SMILES:
Oc1ccc(cc1)-c1sc2cc(O)ccc2c1C(=O)c1ccc(OCCN2CCCCC2)cc1
:
Substrate
Name:
BDBM17292
Synonyms:
(1S,10R,11S,14S,15S)-15-methyltetracyclo[8.7.0.0^{2,7}.0^{11,15}]heptadeca-2,4,6-triene-5,14-diol 17α-ethinylestradiol CHEMBL135 ESTRADIOL Ovocyclin US9040509, E2 US9561238, E2 [2,4,6,7-3H]-E2 [3H]]estradiol
Type:
Steroid
Emp. Form.:
C18H24O2
Mol. Mass.:
272.382
SMILES:
[H][C@@]12CC[C@H](O)[C@@]1(C)CC[C@]1([H])c3ccc(O)cc3CC[C@@]21[H]
: