Target
Bifunctional dihydrofolate reductase-thymidylate synthase
Ligand
BDBM18050
Substrate
BDBM18044
Meas. Tech.
Thymidylate Synthase (TS) Assay
IC50
33±n/a nM
Citation
 Gangjee, ALi, WYang, JKisliuk, RL Design, synthesis, and biological evaluation of classical and nonclassical 2-amino-4-oxo-5-substituted-6-methylpyrrolo[3,2-d]pyrimidines as dual thymidylate synthase and dihydrofolate reductase inhibitors. J Med Chem 51:68-76 (2008)  
Target
Name:
Bifunctional dihydrofolate reductase-thymidylate synthase
Synonyms:
DHFR-TS Dihydrofolate reductase Dihydrofolate reductase; T. gondii vs rat
Type:
Enzyme
Mol. Mass.:
68757.49
Organism:
Toxoplasma gondii
Description:
Q07422
Residue:
610
  
Inhibitor
Name:
BDBM18050
Synonyms:
2-[(4-{[(2,4-diaminopteridin-6-yl)methyl](methyl)amino}phenyl)formamido]pentanedioic acid MTX cid_126941
Type:
Small organic molecule
Emp. Form.:
C20H22N8O5
Mol. Mass.:
454.4393
SMILES:
CN(Cc1cnc2nc(N)nc(N)c2n1)c1ccc(cc1)C(=O)N[C@@H](CCC(O)=O)C(O)=O
:
Substrate
Name:
BDBM18044
Synonyms:
(2S)-2-[(4-{[(2-amino-4-oxo-1,4,7,8-tetrahydropteridin-6-yl)methyl]amino}phenyl)formamido]pentanedioic acid dihydrofolic acid
Type:
Small organic molecule
Emp. Form.:
C19H21N7O6
Mol. Mass.:
443.4133
SMILES:
Nc1nc2NCC(CNc3ccc(cc3)C(=O)N[C@@H](CCC(O)=O)C(O)=O)=Nc2c(=O)[nH]1
: