Target
3-phosphoinositide-dependent protein kinase 1 [51-360]
Ligand
BDBM365948
Substrate
Meas. Tech.
Kinase Assay
IC50
<500±n/a nM
Citation
 Lind, KECao, KLin, EYNguyen, TBTangonan, BTErlanson, DAGuckian, KSimmons, RLLee, WSun, LHansen, SPathan, NZhang, L Methods of treatment using pyridinonyl PDK1 inhibitors US Patent  US9873693 Publication Date 1/23/2018 
Target
Name:
3-phosphoinositide-dependent protein kinase 1 [51-360]
Synonyms:
3-phosphoinositide-dependent protein kinase 1 (PDK1) PDPK1 | PDPK1_HUMAN
Type:
Enzyme Catalytic Domain
Mol. Mass.:
35373.34
Organism:
Homo sapiens (Human)
Description:
(aa 51-360)
Residue:
310
  
Inhibitor
Name:
BDBM365948
Synonyms:
US9873693, Compound 1
Type:
Small organic molecule
Emp. Form.:
C26H24F2N4O2
Mol. Mass.:
462.4912
SMILES:
Fc1ccc(Cn2cccc(C(=O)N[C@H]3CC[C@H](CC3)c3c[nH]c4ncccc34)c2=O)cc1F
: