Target
3-phosphoinositide-dependent protein kinase 1 [51-360]
Ligand
BDBM366080
Substrate
Meas. Tech.
Kinase Assay
IC50
<500±n/a nM
Citation
 Lind, KECao, KLin, EYNguyen, TBTangonan, BTErlanson, DAGuckian, KSimmons, RLLee, WSun, LHansen, SPathan, NZhang, L Methods of treatment using pyridinonyl PDK1 inhibitors US Patent  US9873693 Publication Date 1/23/2018 
Target
Name:
3-phosphoinositide-dependent protein kinase 1 [51-360]
Synonyms:
3-phosphoinositide-dependent protein kinase 1 (PDK1) PDPK1 | PDPK1_HUMAN
Type:
Enzyme Catalytic Domain
Mol. Mass.:
35373.34
Organism:
Homo sapiens (Human)
Description:
(aa 51-360)
Residue:
310
  
Inhibitor
Name:
BDBM366080
Synonyms:
US9873693, Compound 3
Type:
Small organic molecule
Emp. Form.:
C26H19F2N5O2
Mol. Mass.:
471.4582
SMILES:
Fc1ccc(Cn2cccc(C(=O)NCc3cccc(c3)-c3ccc4ncnn4c3)c2=O)cc1F
: