Target
Acid ceramidase
Ligand
BDBM367186
Substrate
Meas. Tech.
Fluorescent-based In Vitro Assa
IC50
10.00±7 nM
Citation
 Piomelli, DPagliuca, CPizzirani, DBach, ARealini, NDe Vivo, M Benzoxazolone derivatives as acid ceramidase inhibitors, and their use as medicaments US Patent  US10226452 Publication Date 3/12/2019 
Target
Name:
Acid ceramidase
Synonyms:
ASAH ASAH1_HUMAN Acid ceramidase (AC)
Type:
Enzyme
Mol. Mass.:
44662.65
Organism:
Homo sapiens (Human)
Description:
Q13510
Residue:
395
  
Inhibitor
Name:
BDBM367186
Synonyms:
6-fluoro-2-oxo-N-(4- phenylbutyl)-1,3- benzoxazole-3-carboxamide | US10226452, Example 3
Type:
Small organic molecule
Emp. Form.:
C18H17FN2O3
Mol. Mass.:
328.3376
SMILES:
Fc1ccc2n(C(=O)NCCCCc3ccccc3)c(=O)oc2c1
: