Target
Acid ceramidase
Ligand
BDBM367209
Substrate
Meas. Tech.
Fluorescent-based In Vitro Assa
IC50
0.800±0.1 nM
Citation
 Piomelli, DPagliuca, CPizzirani, DBach, ARealini, NDe Vivo, M Benzoxazolone derivatives as acid ceramidase inhibitors, and their use as medicaments US Patent  US10226452 Publication Date 3/12/2019 
Target
Name:
Acid ceramidase
Synonyms:
ASAH ASAH1_HUMAN Acid ceramidase (AC)
Type:
Enzyme
Mol. Mass.:
44662.65
Organism:
Homo sapiens (Human)
Description:
Q13510
Residue:
395
  
Inhibitor
Name:
BDBM367209
Synonyms:
2-oxo-4-phenyl-N-(4- phenylbutyl)-1,3- benzoxazole-3-carboxamide | US10226452, Example 26
Type:
Small organic molecule
Emp. Form.:
C24H22N2O3
Mol. Mass.:
386.4431
SMILES:
O=C(NCCCCc1ccccc1)n1c2c(cccc2oc1=O)-c1ccccc1
: