Target
Beta-secretase 1
Ligand
BDBM370640
Substrate
Meas. Tech.
BACE1 HTRF FRET Assay
Ki
1.000±n/a nM
Citation
 He, SCumming, JNScott, JD C5-C6-fused tricyclic iminothiadiazine dioxide compounds as BACE inhibitors, compositions, and their use US Patent  US10238743 Publication Date 3/26/2019 
Target
Name:
Beta-secretase 1
Synonyms:
ASP2 Aspartyl protease 2 BACE1 Beta-secretase (BACE) Beta-secretase 1 (BACE 1) Beta-secretase 1 (BACE1) Beta-site amyloid precursor protein cleaving enzyme 1 Memapsin-2 beta-Secretase (BACE-1) | beta-Secretase (BACE1)
Type:
Protein
Mol. Mass.:
55755.10
Organism:
Homo sapiens (Human)
Description:
P56817
Residue:
501
  
Inhibitor
Name:
BDBM370640
Synonyms:
US10238743, Example 16
Type:
Small organic molecule
Emp. Form.:
C20H20N6O4S
Mol. Mass.:
440.476
SMILES:
CN1C(=N)N[C@@]2(C)[C@H](CCOc3ccc(NC(=O)c4ccc(cn4)C#N)cc23)S1(=O)=O
: