Target
Poly(ADP-ribose) glycohydrolase
Ligand
BDBM371100
Substrate
Meas. Tech.
PARG Assay
IC50
38.0±n/a nM
Citation
 McGonagle, AEJordan, AWaszkowycz, BHutton, CWaddell, IHitchin, JRSmith, KMHamilton, NM 2,4-dioxo-quinazoline-6-sulfonamide derivatives as inhibitors of PARG US Patent  US10239843 Publication Date 3/26/2019 
Target
Name:
Poly(ADP-ribose) glycohydrolase
Synonyms:
PARG Poly(ADP-ribose) glycohydrolase | poly(ADP-ribose) glycohydrolase (PARG)
Type:
Protein
Mol. Mass.:
111107.13
Organism:
Homo sapiens (Human)
Description:
Q86W56
Residue:
976
  
Inhibitor
Name:
BDBM371100
Synonyms:
US10239843, Example 207 | US10239843, Example 285
Type:
Small organic molecule
Emp. Form.:
C23H26N6O5S
Mol. Mass.:
498.555
SMILES:
Cc1cc(Cn2c(=O)n(Cc3cc(C)nn3C)c3ccc(cc3c2=O)S(=O)(=O)NC2(C)CC2)on1
: