Target
Poly(ADP-ribose) glycohydrolase
Ligand
BDBM371294
Substrate
Meas. Tech.
PARG Assay
IC50
8.00±n/a nM
Citation
 McGonagle, AEJordan, AWaszkowycz, BHutton, CWaddell, IHitchin, JRSmith, KMHamilton, NM 2,4-dioxo-quinazoline-6-sulfonamide derivatives as inhibitors of PARG US Patent  US10239843 Publication Date 3/26/2019 
Target
Name:
Poly(ADP-ribose) glycohydrolase
Synonyms:
PARG Poly(ADP-ribose) glycohydrolase | poly(ADP-ribose) glycohydrolase (PARG)
Type:
Protein
Mol. Mass.:
111107.13
Organism:
Homo sapiens (Human)
Description:
Q86W56
Residue:
976
  
Inhibitor
Name:
BDBM371294
Synonyms:
N-(1-Cyanocyclopropyl)-1-[(2,4-dimethylthiazol-5-yl)methyl]-3-[(2-methylthiazol-5-yl)methyl]-2,4-dioxo-quinazoline-6-sulfonamide | US10239843, Example 401
Type:
Small organic molecule
Emp. Form.:
C23H22N6O4S3
Mol. Mass.:
542.654
SMILES:
Cc1ncc(Cn2c(=O)n(Cc3sc(C)nc3C)c3ccc(cc3c2=O)S(=O)(=O)NC2(CC2)C#N)s1
: