Target
ADP-ribosylhydrolase ARH3
Ligand
BDBM371519
Substrate
Meas. Tech.
ARH3 Assay
IC50
>150000±n/a nM
Citation
 McGonagle, AEJordan, AWaszkowycz, BHutton, CWaddell, IHitchin, JRSmith, KMHamilton, NM 2,4-dioxo-quinazoline-6-sulfonamide derivatives as inhibitors of PARG US Patent  US10239843 Publication Date 3/26/2019 
Target
Name:
ADP-ribosylhydrolase ARH3
Synonyms:
ADP-ribose glycohydrolase ARH3 ADPRHL2 ADPRS_HUMAN O-acetyl-ADP-ribose deacetylase ARH3 [Protein ADP-ribosylarginine] hydrolase-like protein 2 | [Protein ADP-ribosylserine] hydrolase
Type:
Enzyme Catalytic Domain
Mol. Mass.:
38934.22
Organism:
Homo sapiens (Human)
Description:
Q9NX46
Residue:
363
  
Inhibitor
Name:
BDBM371519
Synonyms:
N-[1-(Fluoromethyl)cyclopropyl]-1-[(1-methylpyrazol-4-yl)methyl]-3-[(5-methyl-1,3,4-thiadiazol-2-yl)methyl]-2,4-dioxo-quinazoline-6-sulfonamide | US10239843, Example 630
Type:
Small organic molecule
Emp. Form.:
C21H22FN7O4S2
Mol. Mass.:
519.572
SMILES:
Cc1nnc(Cn2c(=O)n(Cc3cnn(C)c3)c3ccc(cc3c2=O)S(=O)(=O)NC2(CF)CC2)s1
: