Target
RAF proto-oncogene serine/threonine-protein kinase
Ligand
BDBM87817
Substrate
Meas. Tech.
In Vitro Raf Activity
IC50
0.040±n/a nM
Citation
 Aversa, RJBarsanti, PABurger, MTDillon, MPDipesa, AHu, CLou, YNishiguchi, GAPan, YPolyakov, VRRamurthy, SRico, ACSetti, LQSmith, ASubramanian, STaft, BRTanner, HRWan, LYusuff, N Biaryl amide compounds as kinase inhibitors US Patent  US10245267 Publication Date 4/2/2019 
Target
Name:
RAF proto-oncogene serine/threonine-protein kinase
Synonyms:
C-Raf Protein Kinase RAF RAF1 Raf-1 Serine/threonine-protein kinase C-Raf | cRaf
Type:
Serine/threonine-protein kinase
Mol. Mass.:
73082.52
Organism:
Homo sapiens (Human)
Description:
P04049
Residue:
648
  
Inhibitor
Name:
BDBM87817
Synonyms:
US10245267, Example 847 US9694016, 847
Type:
Small organic molecule
Emp. Form.:
C25H23F2N5O2
Mol. Mass.:
463.4792
SMILES:
Cc1ccc(NC(=O)c2cccc(c2)C(F)F)cc1-c1cc(N2CCOCC2)c2nccn2n1
: