Target
DNA ligase 1
Ligand
BDBM23079
Substrate
BDBM23028
Meas. Tech.
FAAH Inhibition Assay
Temperature
298.15±n/a K
Ki
0.38±n/a nM
IC50
0.3±n/a nM
Comments
extracted
Citation
 Hardouin, CKelso, MJRomero, FARayl, TJLeung, DHwang, ICravatt, BFBoger, DL Structure-activity relationships of alpha-ketooxazole inhibitors of fatty acid amide hydrolase. J Med Chem 50:3359-68 (2007)  
Target
Name:
DNA ligase 1
Synonyms:
ATP-dependent DNA ligase DNLI1_HUMAN LIG1 | Polydeoxyribonucleotide synthase [ATP]
Type:
Enzyme
Mol. Mass.:
101721.76
Organism:
Homo sapiens (Human)
Description:
Residue:
919
  
Inhibitor
Name:
BDBM23079
Synonyms:
3-[4-(benzyloxy)phenyl]-1-{pyrido[2,3-d][1,3]oxazol-2-yl}propan-1-one | alpha-ketooxazole, 11k
Type:
Small organic molecule
Emp. Form.:
C22H18N2O3
Mol. Mass.:
358.3899
SMILES:
O=C(CCc1ccc(OCc2ccccc2)cc1)c1nc2ncccc2o1
:
Substrate
Name:
BDBM23028
Synonyms:
(9Z)-octadec-9-enamide CHEMBL15927 Oleic acid amide | Oleylamide
Type:
Emp. Form.:
C18H35NO
Mol. Mass.:
281.4766
SMILES:
CCCCCCCC\C=C/CCCCCCCC(N)=O
: