Target
A disintegrin and metalloproteinase with thrombospondin motifs 5
Ligand
BDBM24061
Substrate
BDBM2
Meas. Tech.
Kinesin ATPase In Vitro Assay
pH
7±n/a
Temperature
296.15±n/a K
IC50
2.7±n/a nM
Citation
 Fraley, MEGarbaccio, RMArrington, KLHoffman, WFTasber, ESColeman, PJBuser, CAWalsh, ESHamilton, KFernandes, CSchaber, MDLobell, RBTao, WSouth, VJYan, YKuo, LCPrueksaritanont, TShu, CTorrent, MHeimbrook, DCKohl, NEHuber, HEHartman, GD Kinesin spindle protein (KSP) inhibitors. Part 2: the design, synthesis, and characterization of 2,4-diaryl-2,5-dihydropyrrole inhibitors of the mitotic kinesin KSP. Bioorg Med Chem Lett 16:1775-9 (2006)  
Target
Name:
A disintegrin and metalloproteinase with thrombospondin motifs 5
Synonyms:
A disintegrin and metalloproteinase with thrombospondin motifs 5 (ADAMTS-5) ADAMTS5 ATS5_HUMAN Metalloproteinase with thrombospondin motifs 5 (ADAMTS-5)
Type:
Enzyme
Mol. Mass.:
101769.09
Organism:
Homo sapiens (Human)
Description:
Q9UNA0
Residue:
930
  
Inhibitor
Name:
BDBM24061
Synonyms:
(2S)-2-amino-1-[(2S)-4-(2,5-difluorophenyl)-2-phenyl-2,5-dihydro-1H-pyrrol-1-yl]-3,3-dimethylbutan-1-one | dihydropyrrole, 20
Type:
Small organic molecule
Emp. Form.:
C22H24F2N2O
Mol. Mass.:
370.4356
SMILES:
[H][C@]1(C=C(CN1C(=O)[C@@H](N)C(C)(C)C)c1cc(F)ccc1F)c1ccccc1
:
Substrate
Name:
BDBM2
Synonyms:
({[({[(2R,3S,4R,5R)-5-(6-amino-9H-purin-9-yl)-3,4-dihydroxyoxolan-2-yl]methoxy}(hydroxy)phosphoryl)oxy](hydroxy)phosphoryl}oxy)phosphonic acid Brimonidine ATP | CHEMBL14249
Type:
Nucleoside or nucleotide
Emp. Form.:
C10H16N5O13P3
Mol. Mass.:
507.181
SMILES:
Nc1ncnc2n(cnc12)[C@@H]1O[C@H](COP(O)(=O)OP(O)(=O)OP(O)(O)=O)[C@@H](O)[C@H]1O
: