Target
A disintegrin and metalloproteinase with thrombospondin motifs 5
Ligand
BDBM24103
Substrate
BDBM2
Meas. Tech.
Kinesin ATPase In Vitro Assay
pH
7±n/a
Temperature
296.15±n/a K
IC50
0.2±n/a nM
Citation
 Roecker, AJColeman, PJMercer, SPSchreier, JDBuser, CAWalsh, ESHamilton, KLobell, RBTao, WDiehl, RESouth, VJDavide, JPKohl, NEYan, YKuo, LCLi, CFernandez-Metzler, CMahan, EAPrueksaritanont, THartman, GD Kinesin spindle protein (KSP) inhibitors. Part 8: Design and synthesis of 1,4-diaryl-4,5-dihydropyrazoles as potent inhibitors of the mitotic kinesin KSP. Bioorg Med Chem Lett 17:5677-82 (2007)  
Target
Name:
A disintegrin and metalloproteinase with thrombospondin motifs 5
Synonyms:
A disintegrin and metalloproteinase with thrombospondin motifs 5 (ADAMTS-5) ADAMTS5 ATS5_HUMAN Metalloproteinase with thrombospondin motifs 5 (ADAMTS-5)
Type:
Enzyme
Mol. Mass.:
101769.09
Organism:
Homo sapiens (Human)
Description:
Q9UNA0
Residue:
930
  
Inhibitor
Name:
BDBM24103
Synonyms:
1,4-diaryl-4,5-dihydropyrazole, 25 | 1-[(4R)-4-[3-(dimethylamino)propyl]-1-(2-fluoro-5-methylphenyl)-4-phenyl-4,5-dihydro-1H-pyrazol-3-yl]ethan-1-one
Type:
Small organic molecule
Emp. Form.:
C23H28FN3O
Mol. Mass.:
381.4863
SMILES:
CN(C)CCC[C@]1(CN(N=C1C(C)=O)c1cc(C)ccc1F)c1ccccc1
:
Substrate
Name:
BDBM2
Synonyms:
({[({[(2R,3S,4R,5R)-5-(6-amino-9H-purin-9-yl)-3,4-dihydroxyoxolan-2-yl]methoxy}(hydroxy)phosphoryl)oxy](hydroxy)phosphoryl}oxy)phosphonic acid Brimonidine ATP | CHEMBL14249
Type:
Nucleoside or nucleotide
Emp. Form.:
C10H16N5O13P3
Mol. Mass.:
507.181
SMILES:
Nc1ncnc2n(cnc12)[C@@H]1O[C@H](COP(O)(=O)OP(O)(=O)OP(O)(O)=O)[C@@H](O)[C@H]1O
: