Target
Histone-lysine N-methyltransferase EZH2
Ligand
BDBM378909
Substrate
Meas. Tech.
EZH2 enzymatic activity
IC50
2.00±n/a nM
Citation
 Marx, MALee, MRGalemmo, RABobinski, TP EZH2 inhibitors US Patent  US10266542 Publication Date 4/23/2019 
Target
Name:
Histone-lysine N-methyltransferase EZH2
Synonyms:
ENX-1 EZH2_HUMAN Histone-lysine N-methyltransferase EZH2 Lysine N-methyltransferase 6
Type:
Protein
Mol. Mass.:
85367.84
Organism:
Homo sapiens (Human)
Description:
Q15910
Residue:
746
  
Inhibitor
Name:
BDBM378909
Synonyms:
5,8-dichloro-7-(3,5-dimethyltriazol-4-yl)-2-[(7-methyl-5-oxo-1,6-dihydropyrrolo[2,3-c]pyridin-4-yl)methyl]-3,4-dihydroisoquinolin-1-one | US10266542, Example 15
Type:
Small organic molecule
Emp. Form.:
C22H20Cl2N6O2
Mol. Mass.:
471.339
SMILES:
Cc1nnn(C)c1-c1cc(Cl)c2CCN(Cc3c4cc[nH]c4c(C)[nH]c3=O)C(=O)c2c1Cl
: