Target
Gamma-aminobutyric acid receptor subunit alpha-1 [S204C]/beta-2 [26-512]/gamma-2 [40-467]
Ligand
BDBM26265
Substrate
BDBM26263
Meas. Tech.
Radioligand Binding Assay
Temperature
298.15±n/a K
Ki
57.9±n/a nM
Comments
extracted
Citation
 Hanson, SMMorlock, EVSatyshur, KACzajkowski, C Structural Requirements for Eszopiclone and Zolpidem Binding to the gamma-Aminobutyric Acid Type-A (GABAA) Receptor Are Different. J Med Chem 51:7243-52 (2008)  
Target
Name:
Gamma-aminobutyric acid receptor subunit alpha-1 [S204C]/beta-2 [26-512]/gamma-2 [40-467]
Synonyms:
GABAA Receptor Mutant, alpha-1 (S204C), beta-2, gamma-2
Type:
Protein Complex
Mol. Mass.:
Description:
Components:
This complex has 3 components.
Component 1
Name:
Gamma-aminobutyric acid receptor subunit gamma-2 [40-467]
Synonyms:
GABA(A) receptor subunit gamma-2 GABRG2 Gamma-aminobutyric acid receptor subunit gamma-2
Type:
Ionic channel
Mol. Mass.:
49862.76
Organism:
Homo sapiens (Human)
Description:
P18507[40-467]
Residue:
428
  
Component 2
Name:
Gamma-aminobutyric acid receptor subunit beta-2 [26-512]
Synonyms:
GABA(A) receptor subunit beta-2 GABRB2 Gamma-aminobutyric acid receptor subunit beta-2
Type:
Ionic channel
Mol. Mass.:
56212.32
Organism:
Homo sapiens (Human)
Description:
P47870[26-512]
Residue:
487
  
Component 3
Name:
Gamma-aminobutyric acid receptor subunit alpha-1 [S204C]
Synonyms:
GABA(A) receptor subunit alpha-1 benzodiazepine binding site loop C mutant GABRA1 | GBRA1_HUMAN
Type:
Ionic channel
Mol. Mass.:
48823.87
Organism:
Homo sapiens (Human)
Description:
P14867[S204C]
Residue:
429
  
Inhibitor
Name:
BDBM26265
Synonyms:
(5S)-6-(5-chloropyridin-2-yl)-7-oxo-5H,6H,7H-pyrrolo[3,4-b]pyrazin-5-yl 4-methylpiperazine-1-carboxylate Estorra Lunesta | cid_5735
Type:
Small organic molecule
Emp. Form.:
C17H17ClN6O3
Mol. Mass.:
388.808
SMILES:
CN1CCN(CC1)C(=O)Oc1n(-c2ccc(Cl)cn2)c(=O)c2ncc[nH]c12
:
Substrate
Name:
BDBM26263
Synonyms:
Anexate FLUMAZENIL Romazicon ethyl 12-fluoro-8-methyl-9-oxo-2,4,8-triazatricyclo[8.4.0.0^{2,6}]tetradeca-1(14),3,5,10,12-pentaene-5-carboxylate
Type:
Small organic molecule
Emp. Form.:
C15H14FN3O3
Mol. Mass.:
303.2884
SMILES:
CCOC(=O)c1ncn-2c1CN(C)C(=O)c1cc(F)ccc-21
: