Target
Cathepsin D
Ligand
BDBM26504
Substrate
Fluorescent Substrate
Meas. Tech.
Enzyme Inhibition Assay
IC50
17180±n/a nM
Citation
 Charrier, NClarke, BCutler, LDemont, EDingwall, CDunsdon, REast, PHawkins, JHowes, CHussain, IJeffrey, PMaile, GMatico, RMosley, JNaylor, AO'Brien, ARedshaw, SRowland, PSoleil, VSmith, KJSweitzer, STheobald, PVesey, DWalter, DSWayne, G Second generation of hydroxyethylamine BACE-1 inhibitors: optimizing potency and oral bioavailability. J Med Chem 51:3313-7 (2008)  
Target
Name:
Cathepsin D
Synonyms:
CATD_HUMAN CTSD Cathepsin D heavy chain Cathepsin D precursor
Type:
Enzyme
Mol. Mass.:
44551.72
Organism:
Homo sapiens (Human)
Description:
Human proCathepsin D (SwissProt accession number P07339) was expressed in Sf9 cells, purified, and autoactivated.
Residue:
412
  
Inhibitor
Name:
BDBM26504
Synonyms:
N-[(2S,3R)-4-(benzylamino)-3-hydroxy-1-phenylbutan-2-yl]-3-ethyl-9-methyl-10,10-dioxo-10-thia-1,9-diazatricyclo[6.4.1.0^{4,13}]trideca-2,4(13),5,7-tetraene-6-carboxamide | tricyclic hydroxyethylamine (HEA) derivative, 8b
Type:
Small organic molecule
Emp. Form.:
C31H36N4O4S
Mol. Mass.:
560.707
SMILES:
CCc1cn2CCS(=O)(=O)N(C)c3cc(cc1c23)C(=O)N[C@@H](Cc1ccccc1)[C@H](O)CNCc1ccccc1
:
Substrate
Name:
Fluorescent Substrate
Synonyms:
Type:
Peptide
Mol. Mass.:
2030.30
Organism:
Description:
Residue:
18
FAMSEVNLDAEFKTAMRA