Target
Monoacylglycerol lipase ABHD6
Ligand
BDBM26736
Substrate
BDBM26737
Meas. Tech.
Serine Hydrolase Activity Assay
pH
7.4±n/a
Temperature
295.15±n/a K
IC50
0.09±n/a nM
Citation
 Alexander, JPCravatt, BF The putative endocannabinoid transport blocker LY2183240 is a potent inhibitor of FAAH and several other brain serine hydrolases. J Am Chem Soc 128:9699-704 (2006)  
Target
Name:
Monoacylglycerol lipase ABHD6
Synonyms:
ABHD6_MOUSE Abhd6 Monoacylglycerol lipase ABHD6
Type:
Single-pass type II membrane protein; hydrolase
Mol. Mass.:
38216.17
Organism:
Mus musculus (mouse)
Description:
Assays were using membranes of recombinant Abh6 transiently transfected in COS-7 cells.
Residue:
336
  
Inhibitor
Name:
BDBM26736
Synonyms:
CHEMBL509860 N,N-dimethyl-5-[(4-phenylphenyl)methyl]-1H-1,2,3,4-tetrazole-1-carboxamide
Type:
Small organic molecule
Emp. Form.:
C17H17N5O
Mol. Mass.:
307.3498
SMILES:
CN(C)C(=O)n1nnnc1Cc1ccc(cc1)-c1ccccc1
:
Substrate
Name:
BDBM26737
Synonyms:
9-{2-carboxy-4-[(5-{14-[ethoxy(fluoro)phosphoryl]-2-oxo-3,6,9,12-tetraoxa-1-azatetradecan-1-yl}pentyl)carbamoyl]phenyl}-6-(dimethylamino)-N,N-dimethyl-3H-xanthen-3-iminium rhodamine-tagged fluorophosphonate
Type:
Emp. Form.:
C41H55FN4O11P
Mol. Mass.:
829.8672
SMILES:
CCOP(F)(=O)CCOCCOCCOCCOC(=O)NCCCCCNC(=O)c1ccc(c(c1)C(O)=O)-c1c2ccc(cc2oc2cc(ccc12)=[N+](C)C)N(C)C
: