Target
Disintegrin and metalloproteinase domain-containing protein 17
Ligand
BDBM26791
Substrate
TACE substrate peptide
Meas. Tech.
Enzyme Inhibition Assay
pH
7.5±n/a
Temperature
298.15±n/a K
IC50
1.0±n/a nM
Comments
MMP-1,-2,-9 Ki >2128 nM.
Citation
 Ott, GRAsakawa, NLu, ZAnand, RLiu, RQCovington, MBVaddi, KQian, MNewton, RCChrist, DDTrzaskos, JMDuan, JJ Potent, exceptionally selective, orally bioavailable inhibitors of TNF-alpha Converting Enzyme (TACE): novel 2-substituted-1H-benzo[d]imidazol-1-yl)methyl)benzamide P1' substituents. Bioorg Med Chem Lett 18:1577-82 (2008)  
Target
Name:
Disintegrin and metalloproteinase domain-containing protein 17
Synonyms:
A disintegrin and metalloproteinase domain 17 ADAM 17 Snake venom-like protease TNF-alpha-Converting Enzyme
Type:
Metalloprotease
Mol. Mass.:
12197.99
Organism:
Sus scrofa (pig)
Description:
Partially purified TACE was obtained from porcine spleen.
Residue:
112
  
Inhibitor
Name:
BDBM26791
Synonyms:
benzimidazole analog., 17 | tert-butyl (3S,4S)-3-(hydroxycarbamoyl)-4-({4-[(2-methyl-1H-1,3-benzodiazol-1-yl)methyl]benzene}amido)pyrrolidine-1-carboxylate
Type:
Small organic molecule
Emp. Form.:
C26H31N5O5
Mol. Mass.:
493.5548
SMILES:
Cc1nc2ccccc2n1Cc1ccc(cc1)C(=O)N[C@@H]1CN(C[C@@H]1C(=O)NO)C(=O)OC(C)(C)C
:
Substrate
Name:
TACE substrate peptide
Synonyms:
Type:
Internally quenched peptide
Mol. Mass.:
4119.10
Organism:
Description:
MCA, (7-methoxycoumarin-4-yl)acetyl. Dpa, N-3-(2,4-dinitrophenyl)-L-2,3-diaminopropionyl.
Residue:
39