Target
A-kinase anchor protein 7 isoform gamma
Ligand
BDBM212716
Substrate
Meas. Tech.
Binding Assay
EC50
35400±n/a nM
Citation
 Tasken, KLygren, BOstensen, EKlaveness, J Tertiary amines for use in the treatment of cardiac disorders US Patent  US9951033 Publication Date 4/24/2018 
Target
Name:
A-kinase anchor protein 7 isoform gamma
Synonyms:
A-kinase anchor protein 18 AKAP-18 Akap18 PRKA7 isoform gamma | Protein kinase A-anchoring protein 7 isoform gamma
Type:
Mol. Mass.:
35486.56
Organism:
Mus musculus (Mouse)
Description:
Q7TN79
Residue:
314
  
Inhibitor
Name:
BDBM212716
Synonyms:
US9556111, Table 1.13 | US9951033, Compound Table 1.12
Type:
Small organic molecule
Emp. Form.:
C28H28N2O2S
Mol. Mass.:
456.599
SMILES:
Cc1ccc(CN(CCC(c2ccccc2)c2ccccc2)Cc2nc(cs2)C(O)=O)cc1
: