Target
Cytochrome P450 2C8
Ligand
BDBM50253810
Substrate
Meas. Tech.
Inhibition Assay
IC50
220±n/a nM
Citation
 Diaz, PIsoherranen, NButtrick, BGuilloteau, N Specific inhibitors of cytochrome P450 26 retinoic acid hydroxylase US Patent  US9963439 Publication Date 5/8/2018 
Target
Name:
Cytochrome P450 2C8
Synonyms:
CP2C8_HUMAN CYPIIC8 P450 IIC2 P450 form 1 | S-mephenytoin 4-hydroxylase
Type:
Protein
Mol. Mass.:
55839.23
Organism:
Homo sapiens (Human)
Description:
P10632
Residue:
490
  
Inhibitor
Name:
BDBM50253810
Synonyms:
CHEMBL459505 R-115866 US9963439, Talarozole
Type:
Small organic molecule
Emp. Form.:
C21H23N5S
Mol. Mass.:
377.506
SMILES:
CCC(CC)C(c1ccc(Nc2nc3ccccc3s2)cc1)n1cncn1
: