Target
Bile acid receptor
Ligand
BDBM77086
Substrate
Meas. Tech.
Glycocholic acid Uptake Radiometric Assay
IC50
0.13±n/a nM
Citation
 Gillberg, PGraffner, HStarke, I IBAT inhibitors for the treatment of liver disease US Patent  US9694018 Publication Date 7/4/2017 
Target
Name:
Bile acid receptor
Synonyms:
BAR FXR HRR1 NR1H4_HUMAN RIP14 Retinoid X receptor-interacting protein 14 | farnesoid x receptor
Type:
Nuclear Receptor
Mol. Mass.:
55916.24
Organism:
Homo sapiens (Human)
Description:
Q96RI1
Residue:
486
  
Inhibitor
Name:
BDBM77086
Synonyms:
US10093697, 13. US9694018, 13
Type:
Small organic molecule
Emp. Form.:
C38H50N4O8S2
Mol. Mass.:
754.956
SMILES:
CCCCC1(CCCC)CN(c2ccccc2)c2cc(SC)c(OCC(=O)N[C@@H](C(=O)N[C@@H](C(C)C)C(O)=O)c3ccc(O)cc3)cc2S(=O)(=O)N1
: