Target
Runt-related transcription factor 1
Ligand
BDBM29637
Substrate
Venus-CBFbeta-SMMHC
Meas. Tech.
Identification of compounds inhibiting the binding between the RUNX1 Runt domain and CBFbeta-SMMHC via a time resolved fluorescence resonance energy transfer (TR-FRET) assay.
pH
7.4±n/a
Temperature
296.15±n/a K
IC50
68800±n/a nM
Citation
 PubChem, PC Identification of compounds inhibiting the binding between the RUNX1 Runt domain and CBFb-SMMHC via a time resolved fluorescence resonance energy transfer (TR-FRET) assay. PubChem Bioassay (2009)[AID] 
Target
Name:
Runt-related transcription factor 1
Synonyms:
AML1 CBF-alpha-2 Core-binding factor subunit alpha-2 Polyomavirus enhancer-binding protein 2 alpha B subunit RUNX1_HUMAN | Runt-Related Transcription Factor 1 Isoform AML1C
Type:
Subunit of heterodimeric transcription factor
Mol. Mass.:
48750.25
Organism:
Homo sapiens (Human)
Description:
Q01196
Residue:
453
  
Inhibitor
Name:
BDBM29637
Synonyms:
1-(3-ethoxypropyl)-2-imino-10-methyl-5-oxo-1,5-dihydro-2H-dipyrido[1,2-a:2',3'-d]pyrimidine-3-carbothioamide 1-(3-ethoxypropyl)-2-imino-10-methyl-5-oxodipyrido[3,4-c:1',2'-f]pyrimidine-3-carbothioamide 2-azanylidene-1-(3-ethoxypropyl)-10-methyl-5-oxidanylidene-dipyrido[3,4-c:1',2'-f]pyrimidine-3-carbothioamide SMR000071616 | cid_2927547
Type:
Small organic molecule
Emp. Form.:
C18H21N5O2S
Mol. Mass.:
371.457
SMILES:
CCOCCCn1c2nc3c(C)cccn3c(=O)c2cc(C(N)=S)c1=N
:
Substrate
Name:
Core-binding factor subunit beta isoform 2
Synonyms:
CBFB PEBB_HUMAN Venus-core-binding factor subunit beta-smooth muscle myosin heavy chain
Type:
Fluorescent fusion protein
Mol. Mass.:
21988.19
Organism:
Homo sapiens (Human)
Description:
Q13951-2
Residue:
187