Target
Runt-related transcription factor 1
Ligand
BDBM29688
Substrate
Venus-CBFbeta-SMMHC
Meas. Tech.
Identification of compounds inhibiting the binding between the RUNX1 Runt domain and CBFbeta-SMMHC via a time resolved fluorescence resonance energy transfer (TR-FRET) assay.
pH
7.4±n/a
Temperature
296.15±n/a K
IC50
14600±n/a nM
Citation
 PubChem, PC Identification of compounds inhibiting the binding between the RUNX1 Runt domain and CBFb-SMMHC via a time resolved fluorescence resonance energy transfer (TR-FRET) assay. PubChem Bioassay (2009)[AID] 
Target
Name:
Runt-related transcription factor 1
Synonyms:
AML1 CBF-alpha-2 Core-binding factor subunit alpha-2 Polyomavirus enhancer-binding protein 2 alpha B subunit RUNX1_HUMAN | Runt-Related Transcription Factor 1 Isoform AML1C
Type:
Subunit of heterodimeric transcription factor
Mol. Mass.:
48750.25
Organism:
Homo sapiens (Human)
Description:
Q01196
Residue:
453
  
Inhibitor
Name:
BDBM29688
Synonyms:
3-(9-(3-chloro-4-{[(4-methylphenyl)sulfonyl]oxy}phenyl)-1,8-dioxo-2,3,4,5,6,7,8,9-octahydro-10(1H)-acridinyl)propanoic acid 3-[9-[3-chloranyl-4-(4-methylphenyl)sulfonyloxy-phenyl]-1,8-bis(oxidanylidene)-3,4,5,6,7,9-hexahydro-2H-acridin-10-yl]propanoic acid MLS000704358 cid_1770167
Type:
Small organic molecule
Emp. Form.:
C29H28ClNO7S
Mol. Mass.:
570.053
SMILES:
Cc1ccc(cc1)S(=O)(=O)Oc1ccc(cc1Cl)C1C2=C(CCCC2=O)N(CCC(O)=O)C2=C1C(=O)CCC2
:
Substrate
Name:
Core-binding factor subunit beta isoform 2
Synonyms:
CBFB PEBB_HUMAN Venus-core-binding factor subunit beta-smooth muscle myosin heavy chain
Type:
Fluorescent fusion protein
Mol. Mass.:
21988.19
Organism:
Homo sapiens (Human)
Description:
Q13951-2
Residue:
187