Target
Diacylglycerol O-acyltransferase 1
Ligand
BDBM395359
Substrate
Meas. Tech.
Measurement of DGAT1 Inhibitory Activity
IC50
0.780±n/a nM
Citation
 Saruta, KHayashi, NSakurai, OSawamoto, HOoboki, E Aromatic heterocyclic compound US Patent  US10308636 Publication Date 6/4/2019 
Target
Name:
Diacylglycerol O-acyltransferase 1
Synonyms:
ACAT-related gene product 1 Acyl coA-diacylglycerol acyl transferase 1 (DGAT1) DGAT1 Diacylglycerol Acyltransferase (DGAT1) Diacylglycerol O-acyltransferase 1 (DGAT1) | Diglyceride acyltransferase
Type:
Protein
Mol. Mass.:
55297.82
Organism:
Homo sapiens (Human)
Description:
O75907
Residue:
488
  
Inhibitor
Name:
BDBM395359
Synonyms:
US10308636, Example 44-6
Type:
Small organic molecule
Emp. Form.:
C22H20ClF3N4O3
Mol. Mass.:
480.867
SMILES:
OC(=O)c1cccc(OCC2CCN(CC2)c2ccc(cn2)-c2nc(c[nH]2)C(F)(F)F)c1Cl
: